{"text_format":"1","workbook":"xlsx","n_sheets":18,"sheets":["Index","1.Input -->","P&L assumptions","BS assumptions","2.Output-->","P&L","BS","Cash Flow","DCF valuation","3.Charts  -->","Revenues&Ebitda","Cash flows","Ebitda bridge","Working capital","DCF results","4.Sources -->","P&L source","BS source"],"not_rendered":{"charts":7,"images":0,"macros":1,"external_links":1,"defined_names":0,"comments":0,"pivot_tables":0},"unopened":[],"bounds":{"document_bytes":16777216,"sheet_cells":100000,"rows_first":2000,"rows_last":500,"rows_between":2000,"halvings":0,"cell_chars":16384,"cell_head_chars":4096},"cells_cut":0,"cells_raw":0,"read":"whole","date_system":"1900"}

{"sheet":"Index","index":0,"n_rows":21,"n_cols":3,"rows_kept":21,"cut":false,"hidden":false,"merged":[]}
[null,"DCF Valuation"]
[null,"Sheet index"]
[]
[null,"#                ","Worksheet"]
[null,1,"1.Input -->"]
[null,{"$f":"B5+1","v":2},"P&L assumptions"]
[null,{"$f":"B6+1","v":3},"BS assumptions"]
[null,4,"2.Output -->"]
[null,5,"P&L"]
[null,6,"BS"]
{"$rows_left_out":12}
{"sheet":"1.Input -->","index":1,"n_rows":11,"n_cols":2,"rows_kept":11,"cut":false,"hidden":false,"merged":[]}
[]
[]
[]
[]
[]
[]
[]
[]
[]
[]
{"$rows_left_out":2}
{"sheet":"P&L assumptions","index":2,"n_rows":55,"n_cols":11,"rows_kept":55,"cut":false,"hidden":false,"merged":[]}
[null,"P&L assumptions"]
[null,null,null,null,null,null,"Case scenarios:"]
[null,null,null,null,null,null,"Case 1: Optimistic case"]
[null,null,null,null,null,null,"Case 2: Base case"]
[null,"Selected case",1,null,null,null,"Case 3: Worst case"]
[]
[]
[null,"$ in thousands","FY11\nActual","FY12\nActual","FY13\nActual",null,"FY14\nForecast","FY15\nForecast","FY16\nForecast","FY17\nForecast","FY18\nForecast"]
[null,"Revenues",{"$f":"'P&L source'!D4","v":177203},{"$f":"'P&L source'!E4","v":188618},{"$f":"'P&L source'!F4","v":208366},null,{"$f":"+E9*(1+G10)","v":229202.6},{"$f":"+G9*(1+H10)","v":252122.86},{"$f":"+H9*(1+I10)","v":277335.146},305068.6606,335575.52666]
[null,"y-o-y growth %",0,{"$f":"D9/C9-1","v":0.0644176452994587},{"$f":"E9/D9-1","v":0.104698385095802},null,{"$f":"+CHOOSE($C$5,G11,G12,G13)","v":0.1},{"$f":"+CHOOSE($C$5,H11,H12,H13)","v":0.1},0.1,0.1,0.1]
{"$rows_left_out":46}
{"sheet":"BS assumptions","index":3,"n_rows":21,"n_cols":11,"rows_kept":21,"cut":false,"hidden":false,"merged":[]}
[null,"BS assumptions"]
[]
[]
[null,"$ in thousands","FY11\nActual","FY12\nActual","FY13\nActual",null,"FY14\nForecast","FY15\nForecast","FY16\nForecast","FY17\nForecast","FY18\nForecast"]
[null,"Trade receivable",{"$f":"'BS source'!D11","v":32883.6},{"$f":"'BS source'!E11","v":38556},{"$f":"'BS source'!F11","v":43581.6},null,{"$f":"G6*'P&L assumptions'!G9/360","v":47939.76},{"$f":"H6*'P&L assumptions'!H9/360","v":52733.736},{"$f":"I6*'P&L assumptions'!I9/360","v":58007.1096},{"$f":"J6*'P&L assumptions'!J9/360","v":63807.82056},{"$f":"K6*'P&L assumptions'!K9/360","v":70188.602616}]
[null,"Days receivables (DSO)",{"$f":"C5/'P&L assumptions'!C9*360","v":66.8052798203191},{"$f":"D5/'P&L assumptions'!D9*360","v":73.5887349033496},{"$f":"E5/'P&L assumptions'!E9*360","v":75.2971981993223},null,{"$f":"$E$6","v":75.2971981993223},{"$f":"$E$6","v":75.2971981993223},75.2971981993223,75.2971981993223,75.2971981993223]
[]
[null,"Inventory",{"$f":"'BS source'!D10","v":31167.2},{"$f":"'BS source'!E10","v":36396.8},{"$f":"'BS source'!F10","v":46212},null,{"$f":"-G9*'P&L assumptions'!G$21/360","v":51102.6705119758},{"$f":"-H9*'P&L assumptions'!H$21/360","v":56212.9375631733},{"$f":"-I9*'P&L assumptions'!I$21/360","v":61834.2313194907},{"$f":"-J9*'P&L assumptions'!J$21/360","v":68017.6544514398},{"$f":"-K9*'P&L assumptions'!K$21/360","v":74819.4198965837}]
[null,"Days inventory (DIO)",{"$f":"-C8/'P&L assumptions'!C$21*360","v":78.7965998909792},{"$f":"-D8/'P&L assumptions'!D$21*360","v":87.0203857278101},{"$f":"-E8/'P&L assumptions'!E$21*360","v":105.611926467028},null,{"$f":"$E$9","v":105.611926467028},{"$f":"$E$9","v":105.611926467028},105.611926467028,105.611926467028,105.611926467028]
[]
{"$rows_left_out":12}
{"sheet":"2.Output-->","index":4,"n_rows":11,"n_cols":2,"rows_kept":11,"cut":false,"hidden":false,"merged":[]}
[]
[]
[]
[]
[]
[]
[]
[]
[]
[]
{"$rows_left_out":2}
{"sheet":"P&L","index":5,"n_rows":56,"n_cols":13,"rows_kept":56,"cut":false,"hidden":false,"merged":[]}
[null,"P&L"]
[]
[null,"$ in thousands","FY11\nActual","FY12\nActual","FY13\nActual",null,"FY14\nForecast","FY15\nForecast","FY16\nForecast","FY17\nForecast","FY18\nForecast",null,"Note"]
[null,"Revenues",{"$f":"+SUMIF('P&L assumptions'!$B:$B,'P&L'!$B4,'P&L assumptions'!C:C)","v":177203},{"$f":"+SUMIF('P&L assumptions'!$B:$B,'P&L'!$B4,'P&L assumptions'!D:D)","v":188618},{"$f":"+SUMIF('P&L assumptions'!$B:$B,'P&L'!$B4,'P&L assumptions'!E:E)","v":208366},null,{"$f":"+SUMIF('P&L assumptions'!$B:$B,'P&L'!$B4,'P&L assumptions'!G:G)","v":229202.6},{"$f":"+SUMIF('P&L assumptions'!$B:$B,'P&L'!$B4,'P&L assumptions'!H:H)","v":252122.86},{"$f":"+SUMIF('P&L assumptions'!$B:$B,'P&L'!$B4,'P&L assumptions'!I:I)","v":277335.146},{"$f":"+SUMIF('P&L assumptions'!$B:$B,'P&L'!$B4,'P&L assumptions'!J:J)","v":305068.6606},{"$f":"+SUMIF('P&L assumptions'!$B:$B,'P&L'!$B4,'P&L assumptions'!K:K)","v":335575.52666}]
[null,"Other revenues",{"$f":"+SUMIF('P&L assumptions'!$B:$B,'P&L'!$B5,'P&L assumptions'!C:C)","v":3520},{"$f":"+SUMIF('P&L assumptions'!$B:$B,'P&L'!$B5,'P&L assumptions'!D:D)","v":2416},{"$f":"+SUMIF('P&L assumptions'!$B:$B,'P&L'!$B5,'P&L assumptions'!E:E)","v":2585},null,{"$f":"+SUMIF('P&L assumptions'!$B:$B,'P&L'!$B5,'P&L assumptions'!G:G)","v":2585},{"$f":"+SUMIF('P&L assumptions'!$B:$B,'P&L'!$B5,'P&L assumptions'!H:H)","v":2585},{"$f":"+SUMIF('P&L assumptions'!$B:$B,'P&L'!$B5,'P&L assumptions'!I:I)","v":2585},{"$f":"+SUMIF('P&L assumptions'!$B:$B,'P&L'!$B5,'P&L assumptions'!J:J)","v":2585},{"$f":"+SUMIF('P&L assumptions'!$B:$B,'P&L'!$B5,'P&L assumptions'!K:K)","v":2585}]
[null,"Total Revenues",{"$f":"+C4+C5","v":180723},{"$f":"+D4+D5","v":191034},{"$f":"+E4+E5","v":210951},null,{"$f":"+G4+G5","v":231787.6},254707.86,279920.146,307653.6606,338160.52666]
[]
[null,"Cost of goods sold",{"$f":"+SUMIF('P&L assumptions'!$B:$B,'P&L'!$B8,'P&L assumptions'!C:C)","v":-142394.367466667},{"$f":"+SUMIF('P&L assumptions'!$B:$B,'P&L'!$B8,'P&L assumptions'!D:D)","v":-150572.1664},{"$f":"+SUMIF('P&L assumptions'!$B:$B,'P&L'!$B8,'P&L assumptions'!E:E)","v":-157523.118425397},null,{"$f":"+SUMIF('P&L assumptions'!$B:$B,'P&L'!$B8,'P&L assumptions'!G:G)","v":-174193.976},{"$f":"+SUMIF('P&L assumptions'!$B:$B,'P&L'!$B8,'P&L assumptions'!H:H)","v":-191613.3736},{"$f":"+SUMIF('P&L assumptions'!$B:$B,'P&L'!$B8,'P&L assumptions'!I:I)","v":-210774.71096},{"$f":"+SUMIF('P&L assumptions'!$B:$B,'P&L'!$B8,'P&L assumptions'!J:J)","v":-231852.182056},{"$f":"+SUMIF('P&L assumptions'!$B:$B,'P&L'!$B8,'P&L assumptions'!K:K)","v":-255037.4002616}]
[null,"Gross Margin",{"$f":"+C6+C8","v":38328.6325333333},{"$f":"+D6+D8","v":40461.8336},{"$f":"+E6+E8","v":53427.881574603},null,{"$f":"+G6+G8","v":57593.624},63094.4864,69145.43504,75801.478544,83123.1263984]
[]
{"$rows_left_out":47}
{"sheet":"BS","index":6,"n_rows":26,"n_cols":13,"rows_kept":26,"cut":false,"hidden":false,"merged":[]}
[null,"Balance Sheet"]
[]
[null,"$ in thousands","FY11\nActual","FY12\nActual","FY13\nActual",null,"FY14\nForecast","FY15\nForecast","FY16\nForecast","FY17\nForecast","FY18\nForecast",null,"Note"]
[null,"Intangible assets",{"$f":"'BS source'!D4","v":5961.6},{"$f":"'BS source'!E4","v":5840},{"$f":"'BS source'!F4","v":5650},null,{"$f":"$E$4","v":5650},{"$f":"$E$4","v":5650},5650,5650,5650,null,"Flat"]
[null,"PP&E",{"$f":"+SUMIF('BS assumptions'!$B:$B,BS!$B5,'BS assumptions'!C:C)","v":45106.4},{"$f":"+SUMIF('BS assumptions'!$B:$B,BS!$B5,'BS assumptions'!D:D)","v":49072.4},{"$f":"+SUMIF('BS assumptions'!$B:$B,BS!$B5,'BS assumptions'!E:E)","v":56109.2},null,{"$f":"+SUMIF('BS assumptions'!$B:$B,BS!$B5,'BS assumptions'!G:G)","v":59898.0187693812},{"$f":"+SUMIF('BS assumptions'!$B:$B,BS!$B5,'BS assumptions'!H:H)","v":65887.8206463193},{"$f":"+SUMIF('BS assumptions'!$B:$B,BS!$B5,'BS assumptions'!I:I)","v":72476.6027109513},{"$f":"+SUMIF('BS assumptions'!$B:$B,BS!$B5,'BS assumptions'!J:J)","v":79724.2629820464},{"$f":"+SUMIF('BS assumptions'!$B:$B,BS!$B5,'BS assumptions'!K:K)","v":87696.689280251}]
[null,"Financial assets",{"$f":"'BS source'!D6","v":8824},{"$f":"'BS source'!E6","v":9831},{"$f":"'BS source'!F6","v":10323},null,{"$f":"$E$6","v":10323},{"$f":"$E$6","v":10323},10323,10323,10323,null,"Flat"]
[]
[null,"Inventory",{"$f":"+SUMIF('BS assumptions'!$B:$B,BS!$B8,'BS assumptions'!C:C)","v":31167.2},{"$f":"+SUMIF('BS assumptions'!$B:$B,BS!$B8,'BS assumptions'!D:D)","v":36396.8},{"$f":"+SUMIF('BS assumptions'!$B:$B,BS!$B8,'BS assumptions'!E:E)","v":46212},null,{"$f":"+SUMIF('BS assumptions'!$B:$B,BS!$B8,'BS assumptions'!G:G)","v":51102.6705119758},{"$f":"+SUMIF('BS assumptions'!$B:$B,BS!$B8,'BS assumptions'!H:H)","v":56212.9375631733},{"$f":"+SUMIF('BS assumptions'!$B:$B,BS!$B8,'BS assumptions'!I:I)","v":61834.2313194907},{"$f":"+SUMIF('BS assumptions'!$B:$B,BS!$B8,'BS assumptions'!J:J)","v":68017.6544514398},{"$f":"+SUMIF('BS assumptions'!$B:$B,BS!$B8,'BS assumptions'!K:K)","v":74819.4198965837}]
[null,"Trade receivable",{"$f":"+SUMIF('BS assumptions'!$B:$B,BS!$B9,'BS assumptions'!C:C)","v":32883.6},{"$f":"+SUMIF('BS assumptions'!$B:$B,BS!$B9,'BS assumptions'!D:D)","v":38556},{"$f":"+SUMIF('BS assumptions'!$B:$B,BS!$B9,'BS assumptions'!E:E)","v":43581.6},null,{"$f":"+SUMIF('BS assumptions'!$B:$B,BS!$B9,'BS assumptions'!G:G)","v":47939.76},{"$f":"+SUMIF('BS assumptions'!$B:$B,BS!$B9,'BS assumptions'!H:H)","v":52733.736},{"$f":"+SUMIF('BS assumptions'!$B:$B,BS!$B9,'BS assumptions'!I:I)","v":58007.1096},{"$f":"+SUMIF('BS assumptions'!$B:$B,BS!$B9,'BS assumptions'!J:J)","v":63807.82056},{"$f":"+SUMIF('BS assumptions'!$B:$B,BS!$B9,'BS assumptions'!K:K)","v":70188.602616}]
[null,"Other assets",{"$f":"+SUMIF('BS assumptions'!$B:$B,BS!$B10,'BS assumptions'!C:C)","v":8841.6},{"$f":"+SUMIF('BS assumptions'!$B:$B,BS!$B10,'BS assumptions'!D:D)","v":11359.2},{"$f":"+SUMIF('BS assumptions'!$B:$B,BS!$B10,'BS assumptions'!E:E)","v":17602.8},null,{"$f":"+SUMIF('BS assumptions'!$B:$B,BS!$B10,'BS assumptions'!G:G)","v":14867.5184843393},{"$f":"+SUMIF('BS assumptions'!$B:$B,BS!$B10,'BS assumptions'!H:H)","v":16354.2703327732},{"$f":"+SUMIF('BS assumptions'!$B:$B,BS!$B10,'BS assumptions'!I:I)","v":17989.6973660505},{"$f":"+SUMIF('BS assumptions'!$B:$B,BS!$B10,'BS assumptions'!J:J)","v":19788.6671026556},{"$f":"+SUMIF('BS assumptions'!$B:$B,BS!$B10,'BS assumptions'!K:K)","v":21767.5338129212}]
{"$rows_left_out":17}
{"sheet":"Cash Flow","index":7,"n_rows":36,"n_cols":13,"rows_kept":36,"cut":false,"hidden":false,"merged":[]}
[null,"Cash Flow"]
[null,"."]
[null,"$ in thousands",null,"FY12\nActual","FY13\nActual",null,"FY14\nForecast","FY15\nForecast","FY16\nForecast","FY17\nForecast","FY18\nForecast",null,"Note"]
[null,"EBIT","P&L",{"$f":"'P&L'!D15","v":16564.136},{"$f":"'P&L'!E15","v":23130.213574603},null,{"$f":"'P&L'!G15","v":30089.312},{"$f":"'P&L'!H15","v":32839.7432},{"$f":"'P&L'!I15","v":35865.21752},{"$f":"'P&L'!J15","v":39193.239272},{"$f":"'P&L'!K15","v":42854.0631992}]
[null,"Operating taxes","P&L",{"$f":"+D6*D4","v":-3740.02772047421},{"$f":"+E6*E4","v":-4379.96833643321},null,{"$f":"+G6*G4","v":-5416.07616},{"$f":"+H6*H4","v":-5911.153776},{"$f":"+I6*I4","v":-6455.7391536},{"$f":"+J6*J4","v":-7054.78306896},{"$f":"+K6*K4","v":-7713.731375856}]
[null,"Operating tax rate",null,{"$f":"'P&L'!D22","v":-0.225790691435654},{"$f":"'P&L'!E22","v":-0.189361344300012},null,{"$f":"'P&L'!G22","v":-0.18},{"$f":"'P&L'!H22","v":-0.18},{"$f":"'P&L'!I22","v":-0.18},{"$f":"'P&L'!J22","v":-0.18},{"$f":"'P&L'!K22","v":-0.18}]
[null,"NOPAT",null,{"$f":"SUM(D4:D5)","v":12824.1082795258},{"$f":"SUM(E4:E5)","v":18750.2452381698},null,{"$f":"SUM(G4:G5)","v":24673.23584},{"$f":"SUM(H4:H5)","v":26928.589424},{"$f":"SUM(I4:I5)","v":29409.4783664},{"$f":"SUM(J4:J5)","v":32138.45620304},{"$f":"SUM(K4:K5)","v":35140.331823344}]
[]
[null,"Add-back D&A","P&L",{"$f":"-'P&L'!D14","v":4649.8},{"$f":"-'P&L'!E14","v":6430.66},null,{"$f":"-'P&L'!G14","v":4584.052},{"$f":"-'P&L'!H14","v":5042.4572},{"$f":"-'P&L'!I14","v":5546.70292},{"$f":"-'P&L'!J14","v":6101.373212},{"$f":"-'P&L'!K14","v":6711.5105332}]
[null,"Gross Cash Flow",null,{"$f":"D7+D9","v":17473.9082795258},{"$f":"E7+E9","v":25180.9052381698},null,{"$f":"G7+G9","v":29257.28784},31971.046624,34956.1812864,38239.82941504,41851.842356544,null,"1)"]
{"$rows_left_out":27}
{"sheet":"DCF valuation","index":8,"n_rows":29,"n_cols":13,"rows_kept":29,"cut":false,"hidden":false,"merged":[[13,1,13,10]]}
[null,"DCF Valuation"]
[]
[]
[null,"WACC",0.1]
[null,"g",0.02]
[null,null,null,null,null,null,1,2,3,4,5]
[null,"$ in thousands","FY11\nActual","FY12\nActual","FY13\nActual",null,"FY14\nForecast","FY15\nForecast","FY16\nForecast","FY17\nForecast","FY18\nForecast",null,"Note"]
[null,"UFCF",null,null,null,null,{"$f":"'Cash Flow'!G23","v":17757.3535816529},{"$f":"'Cash Flow'!H23","v":14352.7458407049},{"$f":"'Cash Flow'!I23","v":15576.0504247755},{"$f":"'Cash Flow'!J23","v":16921.685467253},{"$f":"'Cash Flow'!K23","v":18401.8840139784}]
[]
[null,"Discount factor (WACC)",null,null,null,null,{"$f":"1/(1+$C$4)^G6","v":0.909090909090909},{"$f":"1/(1+$C$4)^H6","v":0.826446280991735},0.751314800901578,0.683013455365071,0.620921323059155]
{"$rows_left_out":20}
{"sheet":"3.Charts  -->","index":9,"n_rows":11,"n_cols":2,"rows_kept":11,"cut":false,"hidden":false,"merged":[]}
[]
[]
[]
[]
[]
[]
[]
[]
[]
[]
{"$rows_left_out":2}
{"sheet":"Revenues&Ebitda","index":10,"n_rows":6,"n_cols":11,"rows_kept":6,"cut":false,"hidden":false,"merged":[]}
[null,"Revenues & EBITDA"]
[]
[null,{"$f":"'P&L'!B3","v":"$ in thousands"},{"$f":"'P&L'!C3","v":"FY11\nActual"},{"$f":"'P&L'!D3","v":"FY12\nActual"},{"$f":"'P&L'!E3","v":"FY13\nActual"},null,{"$f":"'P&L'!G3","v":"FY14\nForecast"},{"$f":"'P&L'!H3","v":"FY15\nForecast"},{"$f":"'P&L'!I3","v":"FY16\nForecast"},{"$f":"'P&L'!J3","v":"FY17\nForecast"},{"$f":"'P&L'!K3","v":"FY18\nForecast"}]
[null,{"$f":"'P&L'!B4","v":"Revenues"},{"$f":"'P&L'!C4","v":177203},{"$f":"'P&L'!D4","v":188618},{"$f":"'P&L'!E4","v":208366},null,{"$f":"'P&L'!G4","v":229202.6},{"$f":"'P&L'!H4","v":252122.86},{"$f":"'P&L'!I4","v":277335.146},{"$f":"'P&L'!J4","v":305068.6606},{"$f":"'P&L'!K4","v":335575.52666}]
[null,"EBITDA",{"$f":"'P&L'!C12","v":20317.3173333333},{"$f":"'P&L'!D12","v":21213.936},{"$f":"'P&L'!E12","v":29560.873574603},null,{"$f":"'P&L'!G12","v":34673.364},{"$f":"'P&L'!H12","v":37882.2004},{"$f":"'P&L'!I12","v":41411.92044},{"$f":"'P&L'!J12","v":45294.612484},{"$f":"'P&L'!K12","v":49565.5737324}]
[null,"EBITDA%",{"$f":"C5/C4","v":0.114655605905844},{"$f":"D5/D4","v":0.112470368681674},{"$f":"E5/E4","v":0.141869947950256},null,{"$f":"G5/G4","v":0.151278231573289},{"$f":"H5/H4","v":0.150252937793899},{"$f":"I5/I4","v":0.149320852539908},{"$f":"J5/J4","v":0.148473502309008},{"$f":"K5/K4","v":0.14770318391728}]

{"sheet":"Cash flows","index":11,"n_rows":5,"n_cols":7,"rows_kept":5,"cut":false,"hidden":false,"merged":[]}
[null,"Cash flows"]
[]
[null,"$ in thousands","FY14\nForecast","FY15\nForecast","FY16\nForecast","FY17\nForecast","FY18\nForecast"]
[null,"UFCF",{"$f":"'DCF valuation'!G8","v":17757.3535816529},{"$f":"'DCF valuation'!H8","v":14352.7458407049},{"$f":"'DCF valuation'!I8","v":15576.0504247755},{"$f":"'DCF valuation'!J8","v":16921.685467253},{"$f":"'DCF valuation'!K8","v":18401.8840139784}]
[null,"Present value of UFCF",{"$f":"'DCF valuation'!G11","v":16143.0487105935},{"$f":"'DCF valuation'!H11","v":11861.7734220702},{"$f":"'DCF valuation'!I11","v":11702.5172237231},{"$f":"'DCF valuation'!J11","v":11557.7388615894},{"$f":"'DCF valuation'!K11","v":11426.1221687406}]

{"sheet":"Ebitda bridge","index":12,"n_rows":7,"n_cols":15,"rows_kept":7,"cut":false,"hidden":false,"merged":[]}
[null,"Ebitda bridge"]
[null,null,null,null,null,null,null,null,null,null,{"$f":"C3","v":29560.873574603},{"$f":"K2","v":29560.873574603},{"$f":"L2+L3+C5","v":33726.616},{"$f":"M2","v":33726.616}]
[null,"EBITDA FY13",{"$f":"'P&L'!E12","v":29560.873574603},null,null,null,null,null,null,null,0,{"$f":"C4","v":20836.6},{"$f":"-C5","v":16670.857574603},{"$f":"C6","v":946.748000000007},{"$f":"N3+N2","v":34673.364}]
[null,"Delta Revenues",{"$f":"'P&L'!G4-'P&L'!E4","v":20836.6},null,null,null,null,null,null,null,{"$f":"B3","v":"EBITDA FY13"},{"$f":"B4","v":"Delta Revenues"},{"$f":"B5","v":"Delta Cogs"},{"$f":"B6","v":"Delta Opex"},{"$f":"B7","v":"EBITDA FY14"}]
[null,"Delta Cogs",{"$f":"'P&L'!G8-'P&L'!E8","v":-16670.857574603}]
[null,"Delta Opex",{"$f":"'P&L'!G11-'P&L'!E11","v":946.748000000007}]
[null,"EBITDA FY14"]

{"sheet":"Working capital","index":13,"n_rows":11,"n_cols":11,"rows_kept":11,"cut":false,"hidden":false,"merged":[]}
[null,"Working capital"]
[]
[null,{"$f":"BS!B3","v":"$ in thousands"},{"$f":"BS!C3","v":"FY11\nActual"},{"$f":"BS!D3","v":"FY12\nActual"},{"$f":"BS!E3","v":"FY13\nActual"},null,{"$f":"BS!G3","v":"FY14\nForecast"},{"$f":"BS!H3","v":"FY15\nForecast"},{"$f":"BS!I3","v":"FY16\nForecast"},{"$f":"BS!J3","v":"FY17\nForecast"},{"$f":"BS!K3","v":"FY18\nForecast"}]
[null,{"$f":"BS!B8","v":"Inventory"},{"$f":"BS!C8","v":31167.2},{"$f":"BS!D8","v":36396.8},{"$f":"BS!E8","v":46212},null,{"$f":"BS!G8","v":51102.6705119758},{"$f":"BS!H8","v":56212.9375631733},{"$f":"BS!I8","v":61834.2313194907},{"$f":"BS!J8","v":68017.6544514398},{"$f":"BS!K8","v":74819.4198965837}]
[null,{"$f":"BS!B9","v":"Trade receivable"},{"$f":"BS!C9","v":32883.6},{"$f":"BS!D9","v":38556},{"$f":"BS!E9","v":43581.6},null,{"$f":"BS!G9","v":47939.76},{"$f":"BS!H9","v":52733.736},{"$f":"BS!I9","v":58007.1096},{"$f":"BS!J9","v":63807.82056},{"$f":"BS!K9","v":70188.602616}]
[null,{"$f":"BS!B16","v":"Trade payable"},{"$f":"BS!C16","v":15891.2},{"$f":"BS!D16","v":26351.6},{"$f":"BS!E16","v":36189.6},null,{"$f":"BS!G16","v":40019.5880888124},{"$f":"BS!H16","v":44021.5468976936},{"$f":"BS!I16","v":48423.701587463},{"$f":"BS!J16","v":53266.0717462093},{"$f":"BS!K16","v":58592.6789208302}]
[null,"Working capital",{"$f":"C4+C5-C6","v":48159.6},{"$f":"D4+D5-D6","v":48601.2},{"$f":"E4+E5-E6","v":53604},null,{"$f":"G4+G5-G6","v":59022.8424231634},{"$f":"H4+H5-H6","v":64925.1266654797},{"$f":"I4+I5-I6","v":71417.6393320277},{"$f":"J4+J5-J6","v":78559.4032652305},{"$f":"K4+K5-K6","v":86415.3435917535}]
[]
[null,"DSO",{"$f":"'BS assumptions'!C6","v":66.8052798203191},{"$f":"'BS assumptions'!D6","v":73.5887349033496},{"$f":"'BS assumptions'!E6","v":75.2971981993223},null,{"$f":"'BS assumptions'!G6","v":75.2971981993223},{"$f":"'BS assumptions'!H6","v":75.2971981993223},{"$f":"'BS assumptions'!I6","v":75.2971981993223},{"$f":"'BS assumptions'!J6","v":75.2971981993223},{"$f":"'BS assumptions'!K6","v":75.2971981993223}]
[null,"DIO",{"$f":"'BS assumptions'!C9","v":78.7965998909792},{"$f":"'BS assumptions'!D9","v":87.0203857278101},{"$f":"'BS assumptions'!E9","v":105.611926467028},null,{"$f":"'BS assumptions'!G9","v":105.611926467028},{"$f":"'BS assumptions'!H9","v":105.611926467028},{"$f":"'BS assumptions'!I9","v":105.611926467028},{"$f":"'BS assumptions'!J9","v":105.611926467028},{"$f":"'BS assumptions'!K9","v":105.611926467028}]
{"$rows_left_out":2}
{"sheet":"DCF results","index":14,"n_rows":7,"n_cols":14,"rows_kept":7,"cut":false,"hidden":false,"merged":[]}
[null,"DCF results"]
[]
[]
[null,"Scenario 1",null,null,null,null,"Scenario 2",null,null,null,null,null,"Scenario 3"]
[null,"Enterprise Value",208374.258038159,null,null,null,"Enterprise Value",135602.883717974,null,null,null,null,"Enterprise Value",101216.941660517]
[null,"CFs in Forecast period",0.300858661607022,null,null,null,"CFs in Forecast period",0.315911653369332,null,null,null,null,"CFs in Forecast period",0.334705031166156]
[null,"Continuing Value",0.699141338392978,null,null,null,"Continuing Value",0.684088346630668,null,null,null,null,"Continuing Value",0.665294968833844]

{"sheet":"4.Sources -->","index":15,"n_rows":11,"n_cols":2,"rows_kept":11,"cut":false,"hidden":false,"merged":[]}
[]
[]
[]
[]
[]
[]
[]
[]
[]
[]
{"$rows_left_out":2}
{"sheet":"P&L source","index":16,"n_rows":27,"n_cols":6,"rows_kept":27,"cut":false,"hidden":false,"merged":[]}
[null,"P&L source"]
[]
[null,"USD in thousands",null,"2011\nAct","2012\nAct","2013\nAct"]
[null,"Revenue from sales and services",null,177203,188618,208366]
[null,"Other revenue",null,3520,2416,2585]
[null,"Revenue",null,{"$f":"D4+D5","v":180723},{"$f":"E4+E5","v":191034},{"$f":"F4+F5","v":210951}]
[]
[null,"Raw materials",null,-139903.039466667,-138922.9888,-150080.468825397]
[null,"Direct costs",null,-2491.328,-11649.1776,-7442.6496]
[null,"Cost for services",null,-16389.5936,-17878.3104,-22293.312]
{"$rows_left_out":18}
{"sheet":"BS source","index":17,"n_rows":22,"n_cols":12,"rows_kept":22,"cut":false,"hidden":false,"merged":[]}
[null,"BS source"]
[]
[null,"USD in thousands",null,"31Dec11\nAct","31Dec12\nAct","31Dec13\nAct",null,"USD in thousands",null,"31Dec11\nAct","31Dec12\nAct","31Dec13\nAct"]
[null,"Intangible assets",null,5961.6,5840,5650,null,"Share Capital",null,6784.8,6800,7508]
[null,"PP&E",null,45106.4,49072.4,56109.2,null,"Reserves",null,46224,44414.4,46513.2]
[null,"Financial assets",null,8824,9831,10323,null,"Retained earnings",null,16393.7,25993.7,21516]
[null,null,null,null,null,null,null,"Profit/(loss) for the year",null,12019.8613333333,10458.744,16331.153574603]
[null,"Fixed assets",null,{"$f":"D6+D5+D4","v":59892},{"$f":"E6+E5+E4","v":64743.4},{"$f":"F6+F5+F4","v":72082.2},null,"Total Equity",null,{"$f":"SUM(J4:J7)","v":81422.3613333333},{"$f":"SUM(K4:K7)","v":87666.844},{"$f":"SUM(L4:L7)","v":91868.353574603}]
[]
[null,"Inventory",null,31167.2,36396.8,46212,null,"Trade payable",null,15891.2,26351.6,36189.6]
{"$rows_left_out":12}